BDBM50091753 CHEMBL405854::H-Ser-Leu-Arg-Arg-Ser-Ser-cyclic(Cys-Phe-Gly-Gly-Arg-Met-Asp-Arg-Ile-Gly-Ala-Gln-Ser-Gly-Leu-Gly-Cys)-Asn-Ser-Phe-Arg-Tyr-OH
SMILES CC[C@H](C)[C@@H]1NC(=O)[C@H](CCCNC(N)=N)NC(=O)[C@H](CC(O)=O)NC(=O)[C@H](CCSC)NC(=O)[C@H](CCCNC(N)=N)NC(=O)CNC(=O)CNC(=O)[C@H](Cc2ccccc2)NC(=O)[C@@H](CSSC[C@@H](NC(=O)CNC(=O)[C@H](CC(C)C)NC(=O)CNC(=O)[C@H](CO)NC(=O)[C@H](CCC(N)=O)NC(=O)[C@H](C)NC(=O)CNC1=O)C(=O)N[C@@H](CC(N)=O)C(=O)N[C@@H](CO)C(=O)N[C@@H](Cc1ccccc1)C(=O)N[C@@H](CCCNC(N)=N)C(=O)N[C@H](Cc1ccc(O)cc1)C(O)=O)NC(=O)[C@H](CO)NC(=O)[C@H](CO)NC(=O)[C@H](CCCNC(N)=N)NC(=O)[C@H](CCCNC(N)=N)NC(=O)[C@H](CC(C)C)NC(=O)[C@@H](N)CO
InChI Key InChIKey=NSQLIUXCMFBZME-GDABCYKPSA-N
Data  2 KI
  Tab Delimited (TSV)   2D SDfile   Computed 3D by Vconf -m prep SDfile
Find this compound or compounds like it in BindingDB:
Activity Spreadsheet -- Enzyme Inhibition Constant Data from BindingDB
Found 2 hits for monomerid = 50091753
TargetAtrial natriuretic peptide receptor 3(Homo sapiens (Human))
Astrazeneca Pharmaceuticals
Curated by ChEMBL
LigandPNGBDBM50091753(CHEMBL405854 | H-Ser-Leu-Arg-Arg-Ser-Ser-cyclic(Cy...)
Affinity DataKi:  0.0590nM. Assay description: Displacement of [125I]- ANP from the Atrial Natriuretic Peptide Clearance Receptor.
In DepthDetails ArticlePubMed
TargetAtrial natriuretic peptide receptor 1(Homo sapiens (Human))
Astrazeneca Pharmaceuticals
Curated by ChEMBL
LigandPNGBDBM50091753(CHEMBL405854 | H-Ser-Leu-Arg-Arg-Ser-Ser-cyclic(Cy...)
Affinity DataKi:  0.650nM. Assay description: Displacement of [125I]- ANP from the Atrial natriuretic peptide receptor A.
In DepthDetails ArticlePubMed