BDBM500919 7-((5-((3R,4R]-4- fluoro-3- hydroxypiperidin- 1-yl)pyridin-2- yl)amino)-4- (8-fluoro-7- methylimidazo [1,2-a]pyridin- 3-yl)isoindolin- 1-one::US11021481, Compound I-583::US11078201, Compound I-583::US11548890, Compound I-583
SMILES Cc1ccn2c(cnc2c1F)-c1ccc(Nc2ccc(cn2)N2CC[C@@H](F)[C@H](O)C2)c2C(=O)NCc12
InChI Key InChIKey=HCAWANDUMMHHNH-WIYYLYMNSA-N
Data  5 IC50
  Tab Delimited (TSV)   2D SDfile   Computed 3D by Vconf -m prep SDfile
Find this compound or compounds like it in BindingDB:
Activity Spreadsheet -- Enzyme Inhibition Constant Data from BindingDB
Found 5 hits for monomerid = 500919
TargetMitogen-activated protein kinase kinase kinase kinase 1(Homo sapiens (Human))
Nimbus Saturn
US Patent
LigandPNGBDBM500919(7-((5-((3R,4R]-4- fluoro-3- hydroxypiperidin- 1-yl...)
Affinity DataIC50: <100nM. Assay description: HPK1 biochemical enzyme assay: HPK1 enzyme inhibition was measured using a microfluidic mobility shift assay. Reactions were performed in a 384-well ...
Ligand InfoPC cidPC sid
In DepthDetails US Patent
TargetMitogen-activated protein kinase kinase kinase kinase 1(Homo sapiens (Human))
Nimbus Saturn
US Patent
LigandPNGBDBM500919(7-((5-((3R,4R]-4- fluoro-3- hydroxypiperidin- 1-yl...)
Affinity DataIC50: <100nM. Assay description: HPK1 biochemical enzyme assay: HPK1 enzyme inhibition was measured using a microfluidic mobility shift assay. Reactions were performed in a 384-well ...
Ligand InfoPC cidPC sid
In DepthDetails US Patent
TargetMitogen-activated protein kinase kinase kinase kinase 1(Homo sapiens (Human))
Nimbus Saturn
US Patent
LigandPNGBDBM500919(7-((5-((3R,4R]-4- fluoro-3- hydroxypiperidin- 1-yl...)
Affinity DataIC50: <100nM. Assay description: HPK1 biochemical enzyme assay: HPK1 enzyme inhibition was measured using a microfluidic mobility shift assay. Reactions were performed in a 384-well ...
Ligand InfoPC cidPC sid
In DepthDetails US Patent
TargetMitogen-activated protein kinase kinase kinase kinase 1(Homo sapiens (Human))
Nimbus Saturn
US Patent
LigandPNGBDBM500919(7-((5-((3R,4R]-4- fluoro-3- hydroxypiperidin- 1-yl...)
Affinity DataIC50: <100nM. Assay description: HPK1 biochemical enzyme assay: HPK1 enzyme inhibition was measured using a microfluidic mobility shift assay. Reactions were performed in a 384-well ...
Ligand InfoPC cidPC sid
In DepthDetails US Patent
TargetMitogen-activated protein kinase kinase kinase kinase 1(Homo sapiens (Human))
Nimbus Saturn
US Patent
LigandPNGBDBM500919(7-((5-((3R,4R]-4- fluoro-3- hydroxypiperidin- 1-yl...)
Affinity DataIC50: <100nM. Assay description: HPK1 biochemical enzyme assay: HPK1 enzyme inhibition was measured using a microfluidic mobility shift assay. Reactions were performed in a 384-well ...
Ligand InfoPC cidPC sid
In DepthDetails US Patent