BDBM50093261 CHEMBL131602::N-Acenaphthen-1-ylmethyl-acetamide
SMILES CC(=O)NCC1Cc2cccc3cccc1c23
InChI Key InChIKey=MWMUHSCVSNAERX-UHFFFAOYSA-N
Data  2 KI
  Tab Delimited (TSV)   2D SDfile   Computed 3D by Vconf -m prep SDfile
Find this compound or compounds like it in BindingDB:
Activity Spreadsheet -- Enzyme Inhibition Constant Data from BindingDB
Found 2 hits for monomerid = 50093261
TargetMelatonin receptor type 1B(Homo sapiens (Human))
Paris-Sud University
Curated by ChEMBL
LigandPNGBDBM50093261(CHEMBL131602 | N-Acenaphthen-1-ylmethyl-acetamide)
Affinity DataKi:  0.510nM. Assay description: Binding affinity for melatonin receptor type 1B, expressed in HEK-293 cells (2-[125I]-Iodomelatonin is used as radioligand)
In DepthDetails ArticlePubMed
TargetMelatonin receptor type 1A(Homo sapiens (Human))
Paris-Sud University
Curated by ChEMBL
LigandPNGBDBM50093261(CHEMBL131602 | N-Acenaphthen-1-ylmethyl-acetamide)
Affinity DataKi:  4.24nM. Assay description: Binding affinity for human melatonin receptor type 1A, expressed in HEK-293 cells (2-[125I]-Iodomelatonin is used as radioligand)
In DepthDetails ArticlePubMed