BDBM50094057 CHEMBL410108::GSS(heptyl carbonyl)FLSPEHQRVQQ
SMILES CCCCCCCC(=O)OC[C@H](NC(=O)[C@H](CO)NC(=O)CN)C(=O)N[C@@H](Cc1ccccc1)C(=O)N[C@@H](CC(C)C)C(=O)N[C@@H](CO)C(=O)N1CCC[C@@H]1C(=O)N[C@@H](CCC(O)=O)C(=O)N[C@@H](Cc1cnc[nH]1)C(=O)N[C@@H](CCC(N)=O)C(=O)N[C@@H](CCCNC(N)=N)C(=O)N[C@@H](C(C)C)C(=O)N[C@@H](CCC(N)=O)C(=O)N[C@@H](CCC(N)=O)C(O)=O
InChI Key InChIKey=IIPWFBKPSSXRTG-XQUCVJDWSA-N
Data  1 IC50
  Tab Delimited (TSV)   2D SDfile   Computed 3D by Vconf -m prep SDfile
Find this compound or compounds like it in BindingDB:
Activity Spreadsheet -- Enzyme Inhibition Constant Data from BindingDB
Found 1 hit for monomerid = 50094057
TargetGrowth hormone secretagogue receptor type 1(Homo sapiens (Human))
Merck Research Laboratories
Curated by ChEMBL
LigandPNGBDBM50094057(CHEMBL410108 | GSS(heptyl carbonyl)FLSPEHQRVQQ)
Affinity DataIC50:  9.60nM. Assay description: Binding affinity to cloned human growth hormone secretagogue receptor type 1 in a competitive binding assay with [35S]-MK-0677 as a radiolabeled liga...
In DepthDetails ArticlePubMed