BDBM50094072 (2-Chloro-4-pyrrolidin-1-yl-phenyl)-(7-chloro-2,3,4,5-tetrahydro-benzo[b]azepin-1-yl)-methanone::CHEMBL136628
SMILES Clc1ccc2N(CCCCc2c1)C(=O)c1ccc(cc1Cl)N1CCCC1
InChI Key InChIKey=QQRYLUZKRVXHHB-UHFFFAOYSA-N
Data  1 IC50
  Tab Delimited (TSV)   2D SDfile   Computed 3D by Vconf -m prep SDfile
Find this compound or compounds like it in BindingDB:
Activity Spreadsheet -- Enzyme Inhibition Constant Data from BindingDB
Found 1 hit for monomerid = 50094072
TargetVasopressin V2 receptor(Homo sapiens (Human))
Otsuka Pharmaceutical
Curated by ChEMBL
LigandPNGBDBM50094072((2-Chloro-4-pyrrolidin-1-yl-phenyl)-(7-chloro-2,3,...)
Affinity DataIC50:  16nM. Assay description: Inhibition of [3H]-AVP binding to human Vasopressin V2 receptor expressed in HeLa cells
In DepthDetails ArticlePubMed