BDBM50094086 (4-Allylamino-2-chloro-phenyl)-(2,3,4,5-tetrahydro-benzo[b]azepin-1-yl)-methanone::CHEMBL136644
SMILES Clc1cc(NCC=C)ccc1C(=O)N1CCCCc2ccccc12
InChI Key InChIKey=COHQROKUENHYIT-UHFFFAOYSA-N
Data  1 IC50
  Tab Delimited (TSV)   2D SDfile   Computed 3D by Vconf -m prep SDfile
Find this compound or compounds like it in BindingDB:
Activity Spreadsheet -- Enzyme Inhibition Constant Data from BindingDB
Found 1 hit for monomerid = 50094086
TargetVasopressin V2 receptor(Homo sapiens (Human))
Otsuka Pharmaceutical
Curated by ChEMBL
LigandPNGBDBM50094086((4-Allylamino-2-chloro-phenyl)-(2,3,4,5-tetrahydro...)
Affinity DataIC50:  5.90nM. Assay description: Inhibition of [3H]-AVP binding to human Vasopressin V2 receptor expressed in HeLa cells
In DepthDetails ArticlePubMed