BDBM50094088 CHEMBL136790::[2-Chloro-4-(3-methyl-pyrrolidin-1-yl)-phenyl]-(2,3,4,5-tetrahydro-benzo[b]azepin-1-yl)-methanone
SMILES CC1CCN(C1)c1ccc(C(=O)N2CCCCc3ccccc23)c(Cl)c1
InChI Key InChIKey=XYFVVVNJTQLXTL-UHFFFAOYSA-N
Data  1 IC50
  Tab Delimited (TSV)   2D SDfile   Computed 3D by Vconf -m prep SDfile
Find this compound or compounds like it in BindingDB:
Activity Spreadsheet -- Enzyme Inhibition Constant Data from BindingDB
Found 1 hit for monomerid = 50094088
TargetVasopressin V2 receptor(Homo sapiens (Human))
Otsuka Pharmaceutical
Curated by ChEMBL
LigandPNGBDBM50094088(CHEMBL136790 | [2-Chloro-4-(3-methyl-pyrrolidin-1-...)
Affinity DataIC50:  51nM. Assay description: Inhibition of [3H]-AVP binding to human Vasopressin V2 receptor expressed in HeLa cells
In DepthDetails ArticlePubMed