BDBM50094324 3-Pentafluorobenzenesulfonylamino-N-(5-sulfamoyl-[1,3,4]thiadiazol-2-yl)-propionamide::CHEMBL138920
SMILES NS(=O)(=O)c1nnc(NC(=O)CCNS(=O)(=O)c2c(F)c(F)c(F)c(F)c2F)s1
InChI Key InChIKey=XMOVBRJIOBDWGP-UHFFFAOYSA-N
Data  3 KI
  Tab Delimited (TSV)   2D SDfile   Computed 3D by Vconf -m prep SDfile
Find this compound or compounds like it in BindingDB:
Activity Spreadsheet -- Enzyme Inhibition Constant Data from BindingDB
Found 3 hits for monomerid = 50094324
TargetCarbonic anhydrase 2(Homo sapiens (Human))
Universit£
Curated by ChEMBL
LigandPNGBDBM50094324(3-Pentafluorobenzenesulfonylamino-N-(5-sulfamoyl-[...)
Affinity DataKi:  0.400nM. Assay description: Inhibition of human recombinant carbonic anhydrase II (CA2)
In DepthDetails ArticlePubMed
TargetCarbonic anhydrase 4(Bos taurus (bovine))
Universit£
Curated by ChEMBL
LigandPNGBDBM50094324(3-Pentafluorobenzenesulfonylamino-N-(5-sulfamoyl-[...)
Affinity DataKi:  9nM. Assay description: Inhibition of bovine carbonic anhydrase IV (CA4) from bovine lung microsomes
In DepthDetails ArticlePubMed
TargetCarbonic anhydrase 1(Homo sapiens (Human))
Universit£
Curated by ChEMBL
LigandPNGBDBM50094324(3-Pentafluorobenzenesulfonylamino-N-(5-sulfamoyl-[...)
Affinity DataKi:  200nM. Assay description: Inhibition of human recombinant carbonic anhydrase I (CA1)
In DepthDetails ArticlePubMed