BDBM50094675 3-(2-Diethylamino-ethyl)-1H-indol-4-ol::CHEMBL143202
SMILES CCN(CC)CCc1c[nH]c2cccc(O)c12
InChI Key InChIKey=OHHYMKDBKJPILO-UHFFFAOYSA-N
Data  3 KI  1 EC50
  Tab Delimited (TSV)   2D SDfile   Computed 3D by Vconf -m prep SDfile
Find this compound or compounds like it in BindingDB:
Activity Spreadsheet -- Enzyme Inhibition Constant Data from BindingDB
Found 4 hits for monomerid = 50094675
Target5-hydroxytryptamine receptor 2C(Rattus norvegicus (Rat))
Purdue University
Curated by ChEMBL
LigandPNGBDBM50094675(3-(2-Diethylamino-ethyl)-1H-indol-4-ol | CHEMBL143...)
Affinity DataKi:  10nM. Assay description: Evaluated for the binding constant at [125I]-DOI-labeled rat 5-hydroxytryptamine 2C receptor
In DepthDetails ArticlePubMed
Target5-hydroxytryptamine receptor 2A(Rattus norvegicus (rat))
Purdue University
Curated by ChEMBL
LigandPNGBDBM50094675(3-(2-Diethylamino-ethyl)-1H-indol-4-ol | CHEMBL143...)
Affinity DataKi:  25nM. Assay description: Evaluated for the binding constant at [125I]-DOI-labeled rat 5-hydroxytryptamine 2A receptor
In DepthDetails ArticlePubMed
Target5-hydroxytryptamine receptor 1A(Homo sapiens (Human))
Purdue University
Curated by ChEMBL
LigandPNGBDBM50094675(3-(2-Diethylamino-ethyl)-1H-indol-4-ol | CHEMBL143...)
Affinity DataKi:  49nM. Assay description: Evaluated for the binding constant at [3H]-8-OH-DPAT-labeled human 5-hydroxytryptamine 1A receptor
In DepthDetails ArticlePubMed
Target5-hydroxytryptamine receptor 2A(Rattus norvegicus (rat))
Purdue University
Curated by ChEMBL
LigandPNGBDBM50094675(3-(2-Diethylamino-ethyl)-1H-indol-4-ol | CHEMBL143...)
Affinity DataEC50:  2.31E+3nM. Assay description: Evaluated for the effective concentration at [125I]-DOI-labeled rat 5-hydroxytryptamine 2A receptor
In DepthDetails ArticlePubMed