BDBM50095378 5-(3-Chloro-phenyl)-7-(6-morpholin-4-yl-pyridin-3-yl)-pyrido[2,3-d]pyrimidin-4-ylamine::CHEMBL434500
SMILES Nc1ncnc2nc(cc(-c3cccc(Cl)c3)c12)-c1ccc(nc1)N1CCOCC1
InChI Key InChIKey=QOCDJIRKMNRKJL-UHFFFAOYSA-N
Data  2 IC50
  Tab Delimited (TSV)   2D SDfile   Computed 3D by Vconf -m prep SDfile
Find this compound or compounds like it in BindingDB:
Activity Spreadsheet -- Enzyme Inhibition Constant Data from BindingDB
Found 2 hits for monomerid = 50095378
TargetAdenosine kinase(Rattus norvegicus (rat))
Abbott Laboratories
Curated by ChEMBL
LigandPNGBDBM50095378(5-(3-Chloro-phenyl)-7-(6-morpholin-4-yl-pyridin-3-...)
Affinity DataIC50:  96nM. Assay description: Inhibitory activity against intact cell adenosine kinase by ADO phosphorylation assay
In DepthDetails ArticlePubMed
TargetAdenosine kinase(Rattus norvegicus (rat))
Abbott Laboratories
Curated by ChEMBL
LigandPNGBDBM50095378(5-(3-Chloro-phenyl)-7-(6-morpholin-4-yl-pyridin-3-...)
Affinity DataIC50:  96nM. Assay description: Inhibitory activity against intact cell adenosine kinase by ADO phosphorylation assay
In DepthDetails ArticlePubMed