BDBM50095514 CHEMBL3590491::US10329294, Example 205
SMILES Cn1cc(NC(=O)c2cnn3ccc(N[C@@H]4CCC(F)(F)C[C@@H]4N)nc23)c(n1)C(F)(F)F
InChI Key InChIKey=DDXXGVQDTXIWMM-UHFFFAOYSA-N
Data  2 IC50
  Tab Delimited (TSV)   2D SDfile   Computed 3D by Vconf -m prep SDfile
Find this compound or compounds like it in BindingDB:
Activity Spreadsheet -- Enzyme Inhibition Constant Data from BindingDB
Found 2 hits for monomerid = 50095514
TargetInterleukin-1 receptor-associated kinase 4(Homo sapiens (Human))
Merck Sharp & Dohme
US Patent
LigandPNGBDBM50095514(CHEMBL3590491 | US10329294, Example 205)
Affinity DataIC50:  0.900nM. Assay description: The kinase activity of IRAK4 is determined by its ability to catalyze the phosphorylation of a fluorescent polypeptide substrate. The extent of phosp...
In DepthDetails US Patent
TargetInterleukin-1 receptor-associated kinase 4(Homo sapiens (Human))
Merck Sharp & Dohme
US Patent
LigandPNGBDBM50095514(CHEMBL3590491 | US10329294, Example 205)
Affinity DataIC50:  3nM. Assay description: Inhibition of human IRAK4 assessed as phosphorylation of fluorescent peptide substrate after 30 mins by fluorescent polarization reader
In DepthDetails ArticlePubMed