BDBM50096734 (S)-4-[(S)-3-Carboxy-2-(3-carboxy-propionylamino)-propionylamino]-4-[(S)-1-((S)-2,2-dimethyl-1-{(S)-3-methyl-1-[(R)-3,3,3-trifluoro-1-(4-hydroxy-benzylaminooxalyl)-propylcarbamoyl]-butylcarbamoyl}-propylcarbamoyl)-2-o-tolyl-ethylcarbamoyl]-butyricacid::CHEMBL261963
SMILES CC(C)C[C@H](NC(=O)[C@@H](NC(=O)[C@H](Cc1ccccc1C)NC(=O)[C@H](CCC(O)=O)NC(=O)[C@H](CC(O)=O)NC(=O)CCC(O)=O)C(C)(C)C)C(=O)N[C@H](CC(F)(F)F)C(=O)C(=O)NCc1ccc(O)cc1
InChI Key InChIKey=XKBNMUGCTFZZNE-VNKKIWOVSA-N
Data  1 IC50
  Tab Delimited (TSV)   2D SDfile   Computed 3D by Vconf -m prep SDfile
Find this compound or compounds like it in BindingDB:
Activity Spreadsheet -- Enzyme Inhibition Constant Data from BindingDB
Found 1 hit for monomerid = 50096734
TargetGenome polyprotein/Non-structural protein 4A(Hepatitis C virus)
Roche Discover Welwyn
Curated by ChEMBL
LigandPNGBDBM50096734((S)-4-[(S)-3-Carboxy-2-(3-carboxy-propionylamino)-...)
Affinity DataIC50:  4nM. Assay description: Inhibitory activity against non-nucleoside reverse transcriptase inhibitors (NNRTI) -resistant HIV-1 strain A17 with a Y181C mutation in RT (reverse ...
In DepthDetails ArticlePubMed