BDBM50097708 CHEMBL3588903
SMILES Cc1ccccc1NCc1ccncc1
InChI Key InChIKey=QCDCEUHORMYOQN-UHFFFAOYSA-N
Data  1 KI  1 EC50
  Tab Delimited (TSV)   2D SDfile   Computed 3D by Vconf -m prep SDfile
Find this compound or compounds like it in BindingDB:
Activity Spreadsheet -- Enzyme Inhibition Constant Data from BindingDB
Found 2 hits for monomerid = 50097708
TargetAlpha-2C adrenergic receptor(Homo sapiens (Human))
Gedeon Richter Plc., Gy�Mroi�T 19-21, Budapest H-1103, Hungary.
Curated by ChEMBL
LigandPNGBDBM50097708(CHEMBL3588903)
Affinity DataKi:  537nM. Assay description: Displacement of [3H]-UK14304 from recombinant human alpha2c adrenergic receptor expressed in CHOK1 cell membranes after 30 mins by scintillation coun...
In DepthDetails ArticlePubMed
TargetAlpha-2C adrenergic receptor(Homo sapiens (Human))
Gedeon Richter Plc., Gy�Mroi�T 19-21, Budapest H-1103, Hungary.
Curated by ChEMBL
LigandPNGBDBM50097708(CHEMBL3588903)
Affinity DataEC50: <5.01E+5nM. Assay description: Agonist activity at recombinant human alpha2c adrenergic receptor expressed in CHOK1 cells co-expressing Gqi5 assessed as induction of cytoplasmic ca...
In DepthDetails ArticlePubMed