BDBM50097891 4-Fluoro-5-methoxy-3-(2-pyrrolidin-1-yl-ethyl)-1H-indole::CHEMBL352186
SMILES COc1ccc2[nH]cc(CCN3CCCC3)c2c1F
InChI Key InChIKey=FJCRAYWNOXUYOO-UHFFFAOYSA-N
Data  3 KI
  Tab Delimited (TSV)   2D SDfile   Computed 3D by Vconf -m prep SDfile
Find this compound or compounds like it in BindingDB:
Activity Spreadsheet -- Enzyme Inhibition Constant Data from BindingDB
Found 3 hits for monomerid = 50097891
Target5-hydroxytryptamine receptor 1A(Homo sapiens (Human))
Purdue University
Curated by ChEMBL
LigandPNGBDBM50097891(4-Fluoro-5-methoxy-3-(2-pyrrolidin-1-yl-ethyl)-1H-...)
Affinity DataKi:  0.120nM. Assay description: Binding affinitty towards human 5-hydroxytryptamine 1A receptor was determined using [3H]-8-OH-DPAT-as radioligand
In DepthDetails ArticlePubMed
Target5-hydroxytryptamine receptor 2A(Rattus norvegicus (rat))
Purdue University
Curated by ChEMBL
LigandPNGBDBM50097891(4-Fluoro-5-methoxy-3-(2-pyrrolidin-1-yl-ethyl)-1H-...)
Affinity DataKi:  130nM. Assay description: Binding affinitty towards rat 5-hydroxytryptamine 2A receptor was determined using [125I]- DOI as radioligand
In DepthDetails ArticlePubMed
Target5-hydroxytryptamine receptor 2C(Rattus norvegicus (Rat))
Purdue University
Curated by ChEMBL
LigandPNGBDBM50097891(4-Fluoro-5-methoxy-3-(2-pyrrolidin-1-yl-ethyl)-1H-...)
Affinity DataKi:  140nM. Assay description: Binding affinitty towards rat 5-hydroxytryptamine 2C receptor was determined using [125I]- DOI as radioligand
In DepthDetails ArticlePubMed