BDBM50097897 CHEMBL352933::N-(5-Methyl-1-phenyl-1H-pyrazole-4-carbonyl)-guanidine
SMILES Cc1c(cnn1-c1ccccc1)C(=O)NC(N)=N
InChI Key InChIKey=IAOYHHXUFPDNCZ-UHFFFAOYSA-N
Data  2 IC50
  Tab Delimited (TSV)   2D SDfile   Computed 3D by Vconf -m prep SDfile
Find this compound or compounds like it in BindingDB:
Activity Spreadsheet -- Enzyme Inhibition Constant Data from BindingDB
Found 2 hits for monomerid = 50097897
TargetSodium/hydrogen exchanger 2(Homo sapiens (Human))
Pfizer
Curated by ChEMBL
LigandPNGBDBM50097897(CHEMBL352933 | N-(5-Methyl-1-phenyl-1H-pyrazole-4-...)
Affinity DataIC50:  3.90E+3nM. Assay description: In vitro concentration of compound required to inhibit NHE-2 mediated intracellular maximal pH recovery by 50%
In DepthDetails ArticlePubMed
TargetSodium/hydrogen exchanger 1(Homo sapiens (Human))
Pfizer
Curated by ChEMBL
LigandPNGBDBM50097897(CHEMBL352933 | N-(5-Methyl-1-phenyl-1H-pyrazole-4-...)
Affinity DataIC50:  830nM. Assay description: In vitro concentration required to inhibit NHE-1 mediated intracellular maximal pH recovery by 50%
In DepthDetails ArticlePubMed