BDBM50097931 CHEMBL315712::Sulfamic acid 4-octanoyl-phenyl ester
SMILES CCCCCCCC(=O)c1ccc(OS(N)(=O)=O)cc1
InChI Key InChIKey=KUIYHMJCKWAKMA-UHFFFAOYSA-N
Data  3 IC50
  Tab Delimited (TSV)   2D SDfile   Computed 3D by Vconf -m prep SDfile
Find this compound or compounds like it in BindingDB:
Activity Spreadsheet -- Enzyme Inhibition Constant Data from BindingDB
Found 3 hits for monomerid = 50097931
TargetSteryl-sulfatase(Homo sapiens (Human))
Punjabi University
Curated by ChEMBL
LigandPNGBDBM50097931(CHEMBL315712 | Sulfamic acid 4-octanoyl-phenyl est...)
Affinity DataIC50:  3.40E+3nM. Assay description: Inhibition of placental microsomal estrone sulfatase (unknown origin) using [3H]-estrone sulphate as substrate incubated for 20 mins by scintillation...
In DepthDetails ArticlePubMed
TargetSteryl-sulfatase(Homo sapiens (Human))
Punjabi University
Curated by ChEMBL
LigandPNGBDBM50097931(CHEMBL315712 | Sulfamic acid 4-octanoyl-phenyl est...)
Affinity DataIC50:  5.60E+3nM. Assay description: Inhibition of Estrone sulfatase
In DepthDetails ArticlePubMed
TargetSteryl-sulfatase(Homo sapiens (Human))
Punjabi University
Curated by ChEMBL
LigandPNGBDBM50097931(CHEMBL315712 | Sulfamic acid 4-octanoyl-phenyl est...)
Affinity DataIC50:  5.60E+3nM. Assay description: Inhibition of estrone sulfatase (ES)
In DepthDetails ArticlePubMed