BDBM50098131 5-Methylsulfanyl-4-[2-(4-phenylazo-phenylamino)-thiazol-4-yl]-thiophene-2-carboxamidine::CHEMBL355341
SMILES CSc1sc(cc1-c1csc(Nc2ccc(cc2)\N=N\c2ccccc2)n1)C(N)=N
InChI Key InChIKey=VPPXWZPISZIDSK-CYYJNZCTSA-N
Data  1 KI
  Tab Delimited (TSV)   2D SDfile   Computed 3D by Vconf -m prep SDfile
Find this compound or compounds like it in BindingDB:
Activity Spreadsheet -- Enzyme Inhibition Constant Data from BindingDB
Found 1 hit for monomerid = 50098131
TargetUrokinase-type plasminogen activator(Homo sapiens (Human))
3-Dimensional Pharmaceuticals
Curated by ChEMBL
LigandPNGBDBM50098131(5-Methylsulfanyl-4-[2-(4-phenylazo-phenylamino)-th...)
Affinity DataKi:  180nM. Assay description: In vitro inhibitory activity against Urokinase-type plasminogen activator (microPa)
In DepthDetails ArticlePubMed