BDBM50098153 4-{2-[4-(4-Methoxy-phenyl)-piperazin-1-yl]-thiazol-4-yl}-5-methylsulfanyl-thiophene-2-carboxamidine::CHEMBL171514
SMILES COc1ccc(cc1)N1CCN(CC1)c1nc(cs1)-c1cc(sc1SC)C(N)=N
InChI Key InChIKey=ZBELKJWVARBDCT-UHFFFAOYSA-N
Data  1 KI
  Tab Delimited (TSV)   2D SDfile   Computed 3D by Vconf -m prep SDfile
Find this compound or compounds like it in BindingDB:
Activity Spreadsheet -- Enzyme Inhibition Constant Data from BindingDB
Found 1 hit for monomerid = 50098153
TargetUrokinase-type plasminogen activator(Homo sapiens (Human))
3-Dimensional Pharmaceuticals
Curated by ChEMBL
LigandPNGBDBM50098153(4-{2-[4-(4-Methoxy-phenyl)-piperazin-1-yl]-thiazol...)
Affinity DataKi:  480nM. Assay description: In vitro inhibitory activity against Urokinase-type plasminogen activator (microPa)
In DepthDetails ArticlePubMed