BDBM50098160 5-Methylsulfanyl-4-{2-[4-(5-trifluoromethyl-pyridin-2-yloxy)-phenylamino]-thiazol-4-yl}-thiophene-2-carboxamidine::CHEMBL174193
SMILES CSc1sc(cc1-c1csc(Nc2ccc(Oc3ccc(cn3)C(F)(F)F)cc2)n1)C(N)=N
InChI Key InChIKey=WUXORFQPVDBBOK-UHFFFAOYSA-N
Data  1 KI
  Tab Delimited (TSV)   2D SDfile   Computed 3D by Vconf -m prep SDfile
Find this compound or compounds like it in BindingDB:
Activity Spreadsheet -- Enzyme Inhibition Constant Data from BindingDB
Found 1 hit for monomerid = 50098160
TargetUrokinase-type plasminogen activator(Homo sapiens (Human))
3-Dimensional Pharmaceuticals
Curated by ChEMBL
LigandPNGBDBM50098160(5-Methylsulfanyl-4-{2-[4-(5-trifluoromethyl-pyridi...)
Affinity DataKi:  910nM. Assay description: In vitro inhibitory activity against Urokinase-type plasminogen activator (microPa)
In DepthDetails ArticlePubMed