BDBM50098589 E285::Sodium tetraborate
SMILES [Na+].[Na+].[O-]B(OB=O)OB([O-])OB=O
InChI Key InChIKey=RPAYJVFLNVKVRS-UHFFFAOYSA-N
Data  11 KI
  Tab Delimited (TSV)   2D SDfile   Computed 3D by Vconf -m prep SDfile
Find this compound or compounds like it in BindingDB:
Activity Spreadsheet -- Enzyme Inhibition Constant Data from BindingDB
Found 11 hits for monomerid = 50098589
TargetCarbonic anhydrase 1(Homo sapiens (Human))
University Of Tampere And Tampere University Hospital
Curated by ChEMBL
LigandPNGBDBM50098589(E285 | Sodium tetraborate)
Affinity DataKi:  6.40E+5nM. Assay description: Inhibition of human carbonic anhydrase-1 at 20 degC preincubated for 15 mins by stopped-flow CO2 hydrase assay
In DepthDetails ArticlePubMed
TargetCarbonic anhydrase 1(Homo sapiens (Human))
University Of Tampere And Tampere University Hospital
Curated by ChEMBL
LigandPNGBDBM50098589(E285 | Sodium tetraborate)
Affinity DataKi:  6.40E+5nM. Assay description: Inhibition of human carbonic anhydrase 1 preincubated for 15 mins by stopped flow CO2 hydration method
In DepthDetails ArticlePubMed
TargetCarbonic anhydrase 2(Homo sapiens (Human))
Universit£
Curated by ChEMBL
LigandPNGBDBM50098589(E285 | Sodium tetraborate)
Affinity DataKi:  9.50E+5nM. Assay description: Inhibition of human carbonic anhydrase 2 preincubated for 15 mins by stopped flow CO2 hydration method
In DepthDetails ArticlePubMed
TargetCarbonic anhydrase 2(Homo sapiens (Human))
Universit£
Curated by ChEMBL
LigandPNGBDBM50098589(E285 | Sodium tetraborate)
Affinity DataKi:  9.50E+5nM. Assay description: Inhibition of human carbonic anhydrase 2 preincubated for 15 mins by stopped flow CO2 hydration method
In DepthDetails ArticlePubMed
TargetCarbonic anhydrase 2(Homo sapiens (Human))
Universit£
Curated by ChEMBL
LigandPNGBDBM50098589(E285 | Sodium tetraborate)
Affinity DataKi:  9.50E+5nM. Assay description: Inhibition of human CA2 after 15 mins by stopped-flow/Co2 hydration assay
In DepthDetails ArticlePubMed
TargetCarbonic anhydrase 2(Homo sapiens (Human))
Universit£
Curated by ChEMBL
LigandPNGBDBM50098589(E285 | Sodium tetraborate)
Affinity DataKi:  9.50E+5nM. Assay description: Inhibition of human carbonic anhydrase-2 by CO2 hydration reaction based colorimetric stopped-flow method
In DepthDetails ArticlePubMed
TargetCarbonic anhydrase 2(Homo sapiens (Human))
Universit£
Curated by ChEMBL
LigandPNGBDBM50098589(E285 | Sodium tetraborate)
Affinity DataKi:  9.50E+5nM. Assay description: Inhibition of human recombinant carbonic anhydrase 2 assessed as inhibition of CO2 hydration preincubated for 15 mins by Lineweaver-burk plot method
In DepthDetails ArticlePubMed
TargetCarbonic anhydrase 2(Homo sapiens (Human))
Universit£
Curated by ChEMBL
LigandPNGBDBM50098589(E285 | Sodium tetraborate)
Affinity DataKi:  9.50E+5nM. Assay description: Inhibition of recombinant human carbonic anhydrase 2 assessed as inhibition of CO2 hydration incubated for 15 mins prior to testing by stopped flow C...
In DepthDetails ArticlePubMed
TargetCarbonic anhydrase 2(Homo sapiens (Human))
Universit£
Curated by ChEMBL
LigandPNGBDBM50098589(E285 | Sodium tetraborate)
Affinity DataKi:  9.50E+5nM. Assay description: Inhibition of human CA2 incubated for 15 mins by stopped-flow CO2 hydration assay
In DepthDetails ArticlePubMed
TargetCarbonic anhydrase 2(Homo sapiens (Human))
Universit£
Curated by ChEMBL
LigandPNGBDBM50098589(E285 | Sodium tetraborate)
Affinity DataKi:  9.50E+5nM. Assay description: Inhibition of human carbonic anhydrase 2 by stopped-flow CO2 hydrase assay
In DepthDetails ArticlePubMed
TargetCarbonic anhydrase(Pseudomonas aeruginosa (strain ATCC 15692 / PAO1 /...)
University Of Florida
Curated by ChEMBL
LigandPNGBDBM50098589(E285 | Sodium tetraborate)
Affinity DataKi:  9.10E+6nMpH: 8.3Assay Description:Inhibition of human carbonic anhydrase-2 by CO2 hydration reaction based colorimetric stopped-flow method
In DepthDetails ArticlePubMed