BDBM50098601 CHEMBL3594309
SMILES CC(=O)Nc1cccc(CNC(=O)C(Nc2ccc3c(N)nccc3c2)c2ccccc2)c1
InChI Key InChIKey=XWJBKWASHCYSFJ-UHFFFAOYSA-N
Data  1 KI
  Tab Delimited (TSV)   2D SDfile   Computed 3D by Vconf -m prep SDfile
Find this compound or compounds like it in BindingDB:
Activity Spreadsheet -- Enzyme Inhibition Constant Data from BindingDB
Found 1 hit for monomerid = 50098601
TargetCoagulation factor VII/Tissue factor(Homo sapiens (Human))
TBA
Curated by ChEMBL
LigandPNGBDBM50098601(CHEMBL3594309)
Affinity DataKi:  1.00E+4nM. Assay description: Inhibition of human recombinant TF/F7a complex using S2288 as substrate preincubated for 15 mins followed by protein addition measured for 60 mins
In DepthDetails ArticlePubMed