BDBM50099827 CHEMBL3319582
SMILES C[C@@H](NC(=O)CN1CCOCC1)C(=O)N[C@@H](Cc1c[nH]c2ccccc12)C(=O)N[C@@H](Cc1ccccc1)C(=O)[C@@]1(C)CO1
InChI Key InChIKey=DAFOCGYVTAOKAJ-VIFPVBQESA-N
Data  1 IC50
  Tab Delimited (TSV)   2D SDfile   Computed 3D by Vconf -m prep SDfile
Find this compound or compounds like it in BindingDB:
Activity Spreadsheet -- Enzyme Inhibition Constant Data from BindingDB
Found 1 hit for monomerid = 50099827
TargetProteasome subunit beta type-8(Homo sapiens (Human))
Leiden Institute Of Chemistry And Netherlands Proteomics Centre
Curated by ChEMBL
LigandPNGBDBM50099827(CHEMBL3319582)
Affinity DataIC50:  13nM. Assay description: Inhibition of proteasome subunit beta-5i in human Raji cells using BODIPY-NC005 by fluorescent densitometry
In DepthDetails ArticlePubMed