BDBM50100476 3,5-Dichloro-N-(4-hydroxy-5-hydroxymethyl-2-{6-[(naphthalen-1-ylmethyl)-amino]-9H-purin-3-ylmethyl}-tetrahydro-furan-3-yl)-benzamide::CHEMBL294813
SMILES OC[C@H]1O[C@H]([C@H](NC(=O)c2cc(Cl)cc(Cl)c2)[C@@H]1O)n1cnc2c(NCc3cccc4ccccc34)ncnc12
InChI Key InChIKey=LYWIXWCSWJSYAM-XABBOIKWSA-N
Data  4 IC50
  Tab Delimited (TSV)   2D SDfile   Computed 3D by Vconf -m prep SDfile
Find this compound or compounds like it in BindingDB:
Activity Spreadsheet -- Enzyme Inhibition Constant Data from BindingDB
Found 4 hits for monomerid = 50100476
TargetGlyceraldehyde-3-phosphate dehydrogenase(Homo sapiens (Human))
University Of Washington
Curated by ChEMBL
LigandPNGBDBM50100476(3,5-Dichloro-N-(4-hydroxy-5-hydroxymethyl-2-{6-[(n...)
Affinity DataIC50:  7.50E+4nM. Assay description: In vitro inhibition of Trypanosoma cruzi GAPDH.
In DepthDetails ArticlePubMed
TargetGlyceraldehyde-3-phosphate dehydrogenase, cytosolic(Leishmania mexicana)
University Of Washington
Curated by ChEMBL
LigandPNGBDBM50100476(3,5-Dichloro-N-(4-hydroxy-5-hydroxymethyl-2-{6-[(n...)
Affinity DataIC50:  1.20E+4nM. Assay description: Inhibitory activity against Leishmania mexicana GAPDH
In DepthDetails ArticlePubMed
TargetGlyceraldehyde-3-phosphate dehydrogenase(Homo sapiens (Human))
University Of Washington
Curated by ChEMBL
LigandPNGBDBM50100476(3,5-Dichloro-N-(4-hydroxy-5-hydroxymethyl-2-{6-[(n...)
Affinity DataIC50:  1.00E+5nM. Assay description: In vitro inhibition of Trypanosoma brucei GAPDH.
In DepthDetails ArticlePubMed
TargetGlyceraldehyde-3-phosphate dehydrogenase(Homo sapiens (Human))
University Of Washington
Curated by ChEMBL
LigandPNGBDBM50100476(3,5-Dichloro-N-(4-hydroxy-5-hydroxymethyl-2-{6-[(n...)
Affinity DataIC50: >5.00E+4nM. Assay description: In vitro inhibition of rabbit muscle GAPDH.
In DepthDetails ArticlePubMed