BDBM50100588 6-(4-tert-Butyl-phenyl)-7-(4-dimethylamino-phenyl)-pyrido[2,3-d]pyrimidin-4-ylamine::CHEMBL66568
SMILES CN(C)c1ccc(cc1)-c1nc2ncnc(N)c2cc1-c1ccc(cc1)C(C)(C)C
InChI Key InChIKey=LZNSOVAHFMAUKZ-UHFFFAOYSA-N
Data  2 IC50
  Tab Delimited (TSV)   2D SDfile   Computed 3D by Vconf -m prep SDfile
Find this compound or compounds like it in BindingDB:
Activity Spreadsheet -- Enzyme Inhibition Constant Data from BindingDB
Found 2 hits for monomerid = 50100588
TargetAdenosine kinase(Rattus norvegicus (rat))
Abbott Laboratories
Curated by ChEMBL
LigandPNGBDBM50100588(6-(4-tert-Butyl-phenyl)-7-(4-dimethylamino-phenyl)...)
Affinity DataIC50:  62.5nM. Assay description: In vitro inhibition of Adenosine kinase (AK)
In DepthDetails ArticlePubMed
TargetAdenosine kinase(Homo sapiens (Human))
Abbott Laboratories
Curated by ChEMBL
LigandPNGBDBM50100588(6-(4-tert-Butyl-phenyl)-7-(4-dimethylamino-phenyl)...)
Affinity DataIC50: >1.00E+3nM. Assay description: Inhibition of adenosine phosphorylation in confluent IMR-32 (human neuroblastoma) cells.
In DepthDetails ArticlePubMed