BDBM50102772 2-(2-Hydroxy-3-methyl-phenyl)-1H-benzoimidazole-5-carboxamidine::CHEMBL92964
SMILES Cc1cccc(-c2nc3ccc(cc3[nH]2)C(N)=N)c1O
InChI Key InChIKey=QFGHSAAJZBLSSS-UHFFFAOYSA-N
Data  6 KI
  Tab Delimited (TSV)   2D SDfile   Computed 3D by Vconf -m prep SDfile
Find this compound or compounds like it in BindingDB:
Activity Spreadsheet -- Enzyme Inhibition Constant Data from BindingDB
Found 6 hits for monomerid = 50102772
TargetUrokinase-type plasminogen activator(Homo sapiens (Human))
Axys Pharmaceuticals
Curated by ChEMBL
LigandPNGBDBM50102772(2-(2-Hydroxy-3-methyl-phenyl)-1H-benzoimidazole-5-...)
Affinity DataKi:  8.00E+3nM. Assay description: ComInhibition of Human Serine Protease Urokinase Plasminogen Activator (u-PA).
In DepthDetails ArticlePubMed
TargetCoagulation factor X(Homo sapiens (Human))
Axys Pharmaceuticals
Curated by ChEMBL
LigandPNGBDBM50102772(2-(2-Hydroxy-3-methyl-phenyl)-1H-benzoimidazole-5-...)
Affinity DataKi:  1.00E+4nM. Assay description: Binding affinity against human coagulation factor X
In DepthDetails ArticlePubMed
TargetSerine protease 1(Homo sapiens (Human))
Axys Pharmaceuticals
Curated by ChEMBL
LigandPNGBDBM50102772(2-(2-Hydroxy-3-methyl-phenyl)-1H-benzoimidazole-5-...)
Affinity DataKi:  1.50E+4nM. Assay description: Inhibition of Human Serine Protease Trypsin.
In DepthDetails ArticlePubMed
TargetProthrombin(Homo sapiens (Human))
Axys Pharmaceuticals
Curated by ChEMBL
LigandPNGBDBM50102772(2-(2-Hydroxy-3-methyl-phenyl)-1H-benzoimidazole-5-...)
Affinity DataKi:  4.80E+4nM. Assay description: Inhibition of Human Serine Protease Thrombin.
In DepthDetails ArticlePubMed
TargetPlasminogen(Homo sapiens (Human))
Axys Pharmaceuticals
Curated by ChEMBL
LigandPNGBDBM50102772(2-(2-Hydroxy-3-methyl-phenyl)-1H-benzoimidazole-5-...)
Affinity DataKi:  6.00E+4nM. Assay description: Inhibition of Human Serine Protease Plasmin.
In DepthDetails ArticlePubMed
TargetTissue-type plasminogen activator(Homo sapiens (Human))
Axys Pharmaceuticals
Curated by ChEMBL
LigandPNGBDBM50102772(2-(2-Hydroxy-3-methyl-phenyl)-1H-benzoimidazole-5-...)
Affinity DataKi:  6.90E+4nM. Assay description: Inhibition of Human Serine Protease tissue type Plasminogen Activator (t-PA).
In DepthDetails ArticlePubMed