BDBM50102773 2-(5-Bromo-2-hydroxy-phenyl)-1H-benzoimidazole-5-carboxamidine::CHEMBL94254
SMILES NC(=N)c1ccc2nc([nH]c2c1)-c1cc(Br)ccc1O
InChI Key InChIKey=PUEKXRUIRCAEIO-UHFFFAOYSA-N
Data  6 KI
  Tab Delimited (TSV)   2D SDfile   Computed 3D by Vconf -m prep SDfile
Find this compound or compounds like it in BindingDB:
Activity Spreadsheet -- Enzyme Inhibition Constant Data from BindingDB
Found 6 hits for monomerid = 50102773
TargetUrokinase-type plasminogen activator(Homo sapiens (Human))
Axys Pharmaceuticals
Curated by ChEMBL
LigandPNGBDBM50102773(2-(5-Bromo-2-hydroxy-phenyl)-1H-benzoimidazole-5-c...)
Affinity DataKi:  3.70E+3nM. Assay description: ComInhibition of Human Serine Protease Urokinase Plasminogen Activator (u-PA).
In DepthDetails ArticlePubMed
TargetCoagulation factor X(Homo sapiens (Human))
Axys Pharmaceuticals
Curated by ChEMBL
LigandPNGBDBM50102773(2-(5-Bromo-2-hydroxy-phenyl)-1H-benzoimidazole-5-c...)
Affinity DataKi:  5.70E+3nM. Assay description: Binding affinity against human coagulation factor X
In DepthDetails ArticlePubMed
TargetSerine protease 1(Homo sapiens (Human))
Axys Pharmaceuticals
Curated by ChEMBL
LigandPNGBDBM50102773(2-(5-Bromo-2-hydroxy-phenyl)-1H-benzoimidazole-5-c...)
Affinity DataKi:  1.40E+4nM. Assay description: Inhibition of Human Serine Protease Trypsin.
In DepthDetails ArticlePubMed
TargetPlasminogen(Homo sapiens (Human))
Axys Pharmaceuticals
Curated by ChEMBL
LigandPNGBDBM50102773(2-(5-Bromo-2-hydroxy-phenyl)-1H-benzoimidazole-5-c...)
Affinity DataKi:  2.90E+4nM. Assay description: Inhibition of Human Serine Protease Plasmin.
In DepthDetails ArticlePubMed
TargetProthrombin(Homo sapiens (Human))
Axys Pharmaceuticals
Curated by ChEMBL
LigandPNGBDBM50102773(2-(5-Bromo-2-hydroxy-phenyl)-1H-benzoimidazole-5-c...)
Affinity DataKi:  3.70E+4nM. Assay description: Inhibition of Human Serine Protease Thrombin.
In DepthDetails ArticlePubMed
TargetTissue-type plasminogen activator(Homo sapiens (Human))
Axys Pharmaceuticals
Curated by ChEMBL
LigandPNGBDBM50102773(2-(5-Bromo-2-hydroxy-phenyl)-1H-benzoimidazole-5-c...)
Affinity DataKi:  4.10E+4nM. Assay description: Inhibition of Human Serine Protease tissue type Plasminogen Activator (t-PA).
In DepthDetails ArticlePubMed