BDBM50102781 2-(4-Diethylamino-2-hydroxy-phenyl)-1H-benzoimidazole-5-carboxamidine::CHEMBL330460
SMILES CCN(CC)c1ccc(-c2nc3ccc(cc3[nH]2)C(N)=N)c(O)c1
InChI Key InChIKey=WCAHISANJALHOR-UHFFFAOYSA-N
Data  6 KI
  Tab Delimited (TSV)   2D SDfile   Computed 3D by Vconf -m prep SDfile
Find this compound or compounds like it in BindingDB:
Activity Spreadsheet -- Enzyme Inhibition Constant Data from BindingDB
Found 6 hits for monomerid = 50102781
TargetUrokinase-type plasminogen activator(Homo sapiens (Human))
Axys Pharmaceuticals
Curated by ChEMBL
LigandPNGBDBM50102781(2-(4-Diethylamino-2-hydroxy-phenyl)-1H-benzoimidaz...)
Affinity DataKi:  1.30E+4nM. Assay description: ComInhibition of Human Serine Protease Urokinase Plasminogen Activator (u-PA).
In DepthDetails ArticlePubMed
TargetSerine protease 1(Homo sapiens (Human))
Axys Pharmaceuticals
Curated by ChEMBL
LigandPNGBDBM50102781(2-(4-Diethylamino-2-hydroxy-phenyl)-1H-benzoimidaz...)
Affinity DataKi:  1.60E+4nM. Assay description: Inhibition of Human Serine Protease Trypsin.
In DepthDetails ArticlePubMed
TargetCoagulation factor X(Homo sapiens (Human))
Axys Pharmaceuticals
Curated by ChEMBL
LigandPNGBDBM50102781(2-(4-Diethylamino-2-hydroxy-phenyl)-1H-benzoimidaz...)
Affinity DataKi:  2.50E+4nM. Assay description: Binding affinity against human coagulation factor X
In DepthDetails ArticlePubMed
TargetPlasminogen(Homo sapiens (Human))
Axys Pharmaceuticals
Curated by ChEMBL
LigandPNGBDBM50102781(2-(4-Diethylamino-2-hydroxy-phenyl)-1H-benzoimidaz...)
Affinity DataKi:  8.00E+4nM. Assay description: Inhibition of Human Serine Protease Plasmin.
In DepthDetails ArticlePubMed
TargetProthrombin(Homo sapiens (Human))
Axys Pharmaceuticals
Curated by ChEMBL
LigandPNGBDBM50102781(2-(4-Diethylamino-2-hydroxy-phenyl)-1H-benzoimidaz...)
Affinity DataKi:  9.00E+4nM. Assay description: Inhibition of Human Serine Protease Thrombin.
In DepthDetails ArticlePubMed
TargetTissue-type plasminogen activator(Homo sapiens (Human))
Axys Pharmaceuticals
Curated by ChEMBL
LigandPNGBDBM50102781(2-(4-Diethylamino-2-hydroxy-phenyl)-1H-benzoimidaz...)
Affinity DataKi:  1.00E+5nM. Assay description: Inhibition of Human Serine Protease tissue type Plasminogen Activator (t-PA).
In DepthDetails ArticlePubMed