BDBM50102793 2-(2-Hydroxy-5-methyl-phenyl)-1H-benzoimidazole-5-carboxamidine::CHEMBL433179
SMILES Cc1ccc(O)c(c1)-c1nc2ccc(cc2[nH]1)C(N)=N
InChI Key InChIKey=VPEKNUPXKQVCLF-UHFFFAOYSA-N
Data  6 KI
  Tab Delimited (TSV)   2D SDfile   Computed 3D by Vconf -m prep SDfile
Find this compound or compounds like it in BindingDB:
Activity Spreadsheet -- Enzyme Inhibition Constant Data from BindingDB
Found 6 hits for monomerid = 50102793
TargetUrokinase-type plasminogen activator(Homo sapiens (Human))
Axys Pharmaceuticals
Curated by ChEMBL
LigandPNGBDBM50102793(2-(2-Hydroxy-5-methyl-phenyl)-1H-benzoimidazole-5-...)
Affinity DataKi:  7.50E+3nM. Assay description: ComInhibition of Human Serine Protease Urokinase Plasminogen Activator (u-PA).
In DepthDetails ArticlePubMed
TargetSerine protease 1(Homo sapiens (Human))
Axys Pharmaceuticals
Curated by ChEMBL
LigandPNGBDBM50102793(2-(2-Hydroxy-5-methyl-phenyl)-1H-benzoimidazole-5-...)
Affinity DataKi:  9.00E+3nM. Assay description: Inhibition of Human Serine Protease Trypsin.
In DepthDetails ArticlePubMed
TargetCoagulation factor X(Homo sapiens (Human))
Axys Pharmaceuticals
Curated by ChEMBL
LigandPNGBDBM50102793(2-(2-Hydroxy-5-methyl-phenyl)-1H-benzoimidazole-5-...)
Affinity DataKi:  1.60E+4nM. Assay description: Binding affinity against human coagulation factor X
In DepthDetails ArticlePubMed
TargetPlasminogen(Homo sapiens (Human))
Axys Pharmaceuticals
Curated by ChEMBL
LigandPNGBDBM50102793(2-(2-Hydroxy-5-methyl-phenyl)-1H-benzoimidazole-5-...)
Affinity DataKi:  6.00E+4nM. Assay description: Inhibition of Human Serine Protease Plasmin.
In DepthDetails ArticlePubMed
TargetProthrombin(Homo sapiens (Human))
Axys Pharmaceuticals
Curated by ChEMBL
LigandPNGBDBM50102793(2-(2-Hydroxy-5-methyl-phenyl)-1H-benzoimidazole-5-...)
Affinity DataKi:  6.50E+4nM. Assay description: Inhibition of Human Serine Protease Thrombin.
In DepthDetails ArticlePubMed
TargetTissue-type plasminogen activator(Homo sapiens (Human))
Axys Pharmaceuticals
Curated by ChEMBL
LigandPNGBDBM50102793(2-(2-Hydroxy-5-methyl-phenyl)-1H-benzoimidazole-5-...)
Affinity DataKi:  1.13E+5nM. Assay description: Inhibition of Human Serine Protease tissue type Plasminogen Activator (t-PA).
In DepthDetails ArticlePubMed