BDBM50103071 1-(3-Phenyl-propyl)-2-piperazin-1-yl-1H-benzoimidazole::CHEMBL304534
SMILES C(Cc1ccccc1)Cn1c(nc2ccccc12)N1CCNCC1
InChI Key InChIKey=RGLVXEXQIZDZCD-UHFFFAOYSA-N
Data  1 KI
  Tab Delimited (TSV)   2D SDfile   Computed 3D by Vconf -m prep SDfile
Find this compound or compounds like it in BindingDB:
Activity Spreadsheet -- Enzyme Inhibition Constant Data from BindingDB
Found 1 hit for monomerid = 50103071
Target5-hydroxytryptamine receptor 3A(Homo sapiens (Human))
The University Of Louisiana At Monroe
Curated by ChEMBL
LigandPNGBDBM50103071(1-(3-Phenyl-propyl)-2-piperazin-1-yl-1H-benzoimida...)
Affinity DataKi:  8nM. Assay description: Binding affinity of the compound against human 5-hydroxytryptamine 3A receptor
In DepthDetails ArticlePubMed