BDBM50105364 CHEMBL3597439
SMILES Cl.COc1ccc(cn1)-c1cccc2CC(=O)C(N)CCc12
InChI Key InChIKey=UQHALKDSIKDUBU-UHFFFAOYSA-N
Data  1 KI
  Tab Delimited (TSV)   2D SDfile   Computed 3D by Vconf -m prep SDfile
Find this compound or compounds like it in BindingDB:
Activity Spreadsheet -- Enzyme Inhibition Constant Data from BindingDB
Found 1 hit for monomerid = 50105364
TargetAminopeptidase N(Sus scrofa (Pig))
Universit£
Curated by ChEMBL
LigandPNGBDBM50105364(CHEMBL3597439)
Affinity DataKi:  450nM. Assay description: Inhibition of porcine kidney APN assessed as decrease in p-nitroanilide release using L-leucine-p-nitroanilide as substrate by spectrophotometric ana...
In DepthDetails ArticlePubMed