BDBM50105591 2-(3,4-dihydroxyphenyl)-5,7-dihydroxychroman-3-yl 3,4,5-trihydroxybenzoate::3,4,5-Trihydroxy-benzoic acid 2-(3,4-dihydroxy-phenyl)-5,7-dihydroxy-chroman-3-yl ester::CHEMBL328085::epicatechin gallate
SMILES Oc1cc(O)c2CC(OC(=O)c3cc(O)c(O)c(O)c3)C(Oc2c1)c1ccc(O)c(O)c1
InChI Key InChIKey=LSHVYAFMTMFKBA-UHFFFAOYSA-N
Data  2 IC50
PDB links: 2 PDB IDs match this monomer.
  Tab Delimited (TSV)   2D SDfile   Computed 3D by Vconf -m prep SDfile
Find this compound or compounds like it in BindingDB:
Activity Spreadsheet -- Enzyme Inhibition Constant Data from BindingDB
Found 2 hits for monomerid = 50105591
TargetReplicase polyprotein 1ab(Human SARS coronavirus (SARS-CoV) (Severe acute re...)
Michigan State University
LigandPNGBDBM50105591(2-(3,4-dihydroxyphenyl)-5,7-dihydroxychroman-3-yl ...)
Affinity DataIC50:  1.00E+5nM. Assay description: This is a review article. Please point to the original journal.
In DepthDetails ArticlePubMed
TargetAcetylcholinesterase(Homo sapiens (Human))
Sichuan University
Curated by ChEMBL
LigandPNGBDBM50105591(2-(3,4-dihydroxyphenyl)-5,7-dihydroxychroman-3-yl ...)
Affinity DataIC50:  2.80E+4nM. Assay description: Inhibition of AChE
In DepthDetails ArticlePubMed