BDBM50105627 CHEMBL3597458
SMILES Cl.COc1cc(ccn1)-c1cccc2CCC(N)C(=O)Cc12
InChI Key InChIKey=IBTLDKVJQMRHAC-UHFFFAOYSA-N
Data  1 KI
  Tab Delimited (TSV)   2D SDfile   Computed 3D by Vconf -m prep SDfile
Find this compound or compounds like it in BindingDB:
Activity Spreadsheet -- Enzyme Inhibition Constant Data from BindingDB
Found 1 hit for monomerid = 50105627
TargetAminopeptidase N(Sus scrofa (Pig))
Universit£
Curated by ChEMBL
LigandPNGBDBM50105627(CHEMBL3597458)
Affinity DataKi:  160nM. Assay description: Inhibition of porcine kidney APN assessed as decrease in p-nitroanilide release using L-leucine-p-nitroanilide as substrate by spectrophotometric ana...
In DepthDetails ArticlePubMed