BDBM50106700 1-[6-(4,5-Diphenyl-1H-imidazole-2-sulfinyl)-hexyl]-3,5-dimethyl-1H-pyrazole::CHEMBL434418::RP-73163
SMILES Cc1cc(C)n(CCCCCCS(=O)c2nc(c([nH]2)-c2ccccc2)-c2ccccc2)n1
InChI Key InChIKey=TVSPJKIQOPZAPE-UHFFFAOYSA-N
Data  1 IC50
  Tab Delimited (TSV)   2D SDfile   Computed 3D by Vconf -m prep SDfile
Find this compound or compounds like it in BindingDB:
Activity Spreadsheet -- Enzyme Inhibition Constant Data from BindingDB
Found 1 hit for monomerid = 50106700
TargetSterol O-acyltransferase 1(Rattus norvegicus)
Università
Curated by ChEMBL
LigandPNGBDBM50106700(1-[6-(4,5-Diphenyl-1H-imidazole-2-sulfinyl)-hexyl]...)
Affinity DataIC50:  100nM. Assay description: In vitro acyl-coenzyme A:cholesterol acyltransferase inhibition in rat liver microsomes
In DepthDetails ArticlePubMed