BDBM50107334 8-[4-(4-Azido-3-iodo-phenyl)-butyl]-3-(4-chloro-phenyl)-8-aza-bicyclo[3.2.1]octane-2-carboxylic acid methyl ester::CHEMBL136566
SMILES COC(=O)C1C2CCC(CC1c1ccc(Cl)cc1)N2CCCCc1ccc(N=[N+]=[N-])c(I)c1
InChI Key InChIKey=ASVYHUAGODGJSA-UHFFFAOYSA-N
Data  1 KI
  Tab Delimited (TSV)   2D SDfile   Computed 3D by Vconf -m prep SDfile
Find this compound or compounds like it in BindingDB:
Activity Spreadsheet -- Enzyme Inhibition Constant Data from BindingDB
Found 1 hit for monomerid = 50107334
TargetSodium-dependent dopamine transporter(Rattus norvegicus (rat))
National Institute On Drug Abuse-Intramural Research Program
Curated by ChEMBL
LigandPNGBDBM50107334(8-[4-(4-Azido-3-iodo-phenyl)-butyl]-3-(4-chloro-ph...)
Affinity DataKi:  33nM. Assay description: Displacement of [3H]WIN-35 428 binding at dopamine transporter (DAT) in rat caudate putamen
In DepthDetails ArticlePubMed