BDBM50107874 (5,6-Dimethoxy-indan-2-yl)-propyl-(2-thiophen-3-yl-ethyl)-amine::CHEMBL142481
SMILES CCCN(CCc1ccsc1)C1Cc2cc(OC)c(OC)cc2C1
InChI Key InChIKey=QFFWSYBNWWOHJV-UHFFFAOYSA-N
Data  2 KI
  Tab Delimited (TSV)   2D SDfile   Computed 3D by Vconf -m prep SDfile
Find this compound or compounds like it in BindingDB:
Activity Spreadsheet -- Enzyme Inhibition Constant Data from BindingDB
Found 2 hits for monomerid = 50107874
TargetD(3) dopamine receptor(Rattus norvegicus (Rat))
Pharmacia
Curated by ChEMBL
LigandPNGBDBM50107874((5,6-Dimethoxy-indan-2-yl)-propyl-(2-thiophen-3-yl...)
Affinity DataKi:  14nM. Assay description: Affinity at rat D3 dopamine receptor on CHO cell membranes by [3H]-spiperone displacement.
In DepthDetails ArticlePubMed
TargetD(2) dopamine receptor(Rattus norvegicus (rat))
Pharmacia
Curated by ChEMBL
LigandPNGBDBM50107874((5,6-Dimethoxy-indan-2-yl)-propyl-(2-thiophen-3-yl...)
Affinity DataKi:  61nM. Assay description: Affinity at D2 dopamine receptor on CHO cell membranes by [3H]-PNU-86170 displacement.
In DepthDetails ArticlePubMed