BDBM50107879 (5,6-Dimethoxy-indan-2-yl)-propyl-[2-(4-trifluoromethyl-phenyl)-ethyl]-amine::CHEMBL344524
SMILES CCCN(CCc1ccc(cc1)C(F)(F)F)C1Cc2cc(OC)c(OC)cc2C1
InChI Key InChIKey=WTDNZXBSHAXHEU-UHFFFAOYSA-N
Data  2 KI
  Tab Delimited (TSV)   2D SDfile   Computed 3D by Vconf -m prep SDfile
Find this compound or compounds like it in BindingDB:
Activity Spreadsheet -- Enzyme Inhibition Constant Data from BindingDB
Found 2 hits for monomerid = 50107879
TargetD(3) dopamine receptor(Rattus norvegicus (Rat))
Pharmacia
Curated by ChEMBL
LigandPNGBDBM50107879((5,6-Dimethoxy-indan-2-yl)-propyl-[2-(4-trifluorom...)
Affinity DataKi:  34nM. Assay description: Affinity at rat D3 dopamine receptor on CHO cell membranes by [3H]-spiperone displacement.
In DepthDetails ArticlePubMed
TargetD(2) dopamine receptor(Rattus norvegicus (rat))
Pharmacia
Curated by ChEMBL
LigandPNGBDBM50107879((5,6-Dimethoxy-indan-2-yl)-propyl-[2-(4-trifluorom...)
Affinity DataKi:  310nM. Assay description: Affinity at D2 dopamine receptor on CHO cell membranes by [3H]-PNU-86170 displacement.
In DepthDetails ArticlePubMed