BDBM50108603 CHEMBL3596215
SMILES [I-].O\N=C\c1ccc[n+](CC(=O)Nc2nc(cs2)-c2ccccc2)c1
InChI Key InChIKey=PUQMKYFYHSPDOJ-WUBZALIBSA-N
Data  3 Kd
  Tab Delimited (TSV)   2D SDfile   Computed 3D by Vconf -m prep SDfile
Find this compound or compounds like it in BindingDB:
Activity Spreadsheet -- Enzyme Inhibition Constant Data from BindingDB
Found 3 hits for monomerid = 50108603
TargetAcetylcholinesterase(Homo sapiens (Human))
Defence Research & Development Establishment (Drde)
Curated by ChEMBL
LigandPNGBDBM50108603(CHEMBL3596215)
Affinity DataKd:  7.63E+5nM. Assay description: Reactivation of O-ethylsarin-inhibited human acetylcholinesterase assessed as dissociation constant incubated for 60 mins using ATChI substrate by DT...
In DepthDetails ArticlePubMed
TargetAcetylcholinesterase(Homo sapiens (Human))
Defence Research & Development Establishment (Drde)
Curated by ChEMBL
LigandPNGBDBM50108603(CHEMBL3596215)
Affinity DataKd:  3.51E+5nM. Assay description: Reactivation of VX-inhibited human acetylcholinesterase assessed as dissociation constant incubated for 60 mins using ATChI substrate by DTNB dye bas...
In DepthDetails ArticlePubMed
TargetAcetylcholinesterase(Homo sapiens (Human))
Defence Research & Development Establishment (Drde)
Curated by ChEMBL
LigandPNGBDBM50108603(CHEMBL3596215)
Affinity DataKd:  6.83E+5nM. Assay description: Reactivation of sarin-inhibited human acetylcholinesterase assessed as dissociation constant incubated for 60 mins using ATChI substrate by DTNB dye ...
In DepthDetails ArticlePubMed