BDBM50110078 3-Chloro-4-hydroxy-benzoic acid [1-[4-(4-isopropyl-benzyloxy)-phenyl]-meth-(E)-ylidene]-hydrazide::CHEMBL160652
SMILES CC(C)c1ccc(COc2ccc(\C=N\NC(=O)c3ccc(O)c(Cl)c3)cc2)cc1
InChI Key InChIKey=GJZDCEHKQKJDGA-VULFUBBASA-N
Data  1 IC50
  Tab Delimited (TSV)   2D SDfile   Computed 3D by Vconf -m prep SDfile
Find this compound or compounds like it in BindingDB:
Activity Spreadsheet -- Enzyme Inhibition Constant Data from BindingDB
Found 1 hit for monomerid = 50110078
TargetGlucagon receptor(Homo sapiens (Human))
Pfizer
Curated by ChEMBL
LigandPNGBDBM50110078(3-Chloro-4-hydroxy-benzoic acid [1-[4-(4-isopropyl...)
Affinity DataIC50:  1.50E+3nM. Assay description: In vitro inhibitory activity against human glucagon receptor using [127I]-labeled glucagon
In DepthDetails ArticlePubMed