BDBM50110374 4-{3-[(S)-3-(2,3-Dihydro-benzofuran-5-sulfonylamino)-2-oxo-azepan-1-yl]-2-oxo-propyl}-3-fluoro-benzamidine::CHEMBL162289
SMILES NC(=N)c1ccc(CC(=O)CN2CCCC[C@H](NS(=O)(=O)c3ccc4OCCc4c3)C2=O)c(F)c1
InChI Key InChIKey=OBRCAKGVHQFHGX-NRFANRHFSA-N
Data  3 KI
  Tab Delimited (TSV)   2D SDfile   Computed 3D by Vconf -m prep SDfile
Find this compound or compounds like it in BindingDB:
Activity Spreadsheet -- Enzyme Inhibition Constant Data from BindingDB
Found 3 hits for monomerid = 50110374
TargetTrypsin(Homo sapiens (Human))
Corvas International
Curated by ChEMBL
LigandPNGBDBM50110374(4-{3-[(S)-3-(2,3-Dihydro-benzofuran-5-sulfonylamin...)
Affinity DataKi:  7.60nM. Assay description: Inhibitory constant against trypsin determined in Vitro
In DepthDetails ArticlePubMed
TargetProthrombin(Homo sapiens (Human))
Corvas International
Curated by ChEMBL
LigandPNGBDBM50110374(4-{3-[(S)-3-(2,3-Dihydro-benzofuran-5-sulfonylamin...)
Affinity DataKi:  30nM. Assay description: Inhibitory constant against human thrombin (FIIa) determined in vitro
In DepthDetails ArticlePubMed
TargetCoagulation factor X(Homo sapiens (Human))
Corvas International
Curated by ChEMBL
LigandPNGBDBM50110374(4-{3-[(S)-3-(2,3-Dihydro-benzofuran-5-sulfonylamin...)
Affinity DataKi: >338nM. Assay description: Inhibitory constant against human Coagulation factor Xa determined in Vitro
In DepthDetails ArticlePubMed