BDBM50110579 4-Iodo-6-nitro-2-piperazin-1-yl-quinoline::CHEMBL167475
SMILES [O-][N+](=O)c1ccc2nc(cc(I)c2c1)N1CCNCC1
InChI Key InChIKey=ABNBXDNNSDJWKN-UHFFFAOYSA-N
Data  1 KI
  Tab Delimited (TSV)   2D SDfile   Computed 3D by Vconf -m prep SDfile
Find this compound or compounds like it in BindingDB:
Activity Spreadsheet -- Enzyme Inhibition Constant Data from BindingDB
Found 1 hit for monomerid = 50110579
TargetSodium-dependent serotonin transporter(Rattus norvegicus (rat))
Inha University
Curated by ChEMBL
LigandPNGBDBM50110579(4-Iodo-6-nitro-2-piperazin-1-yl-quinoline | CHEMBL...)
Affinity DataKi:  1.70nM. Assay description: Displacement of [3H]citalopram from rat cortical serotonin transporter (SERT)
In DepthDetails ArticlePubMed