BDBM501106 4-(7- fluoroimidazo [1,2-a]pyridin- 3-yl)-7-((6-(((S)-3- hxdroxypyrroli din-1-yl)methyl)-5-((R)- tetrahydrofur- an-3-yl)pyridin- 2-yl)amino)isoin- dolin-1-one::US11021481, Compound I-778::US11078201, Compound I-778::US11548890, Compound I-778
SMILES O[C@H]1CCN(Cc2nc(Nc3ccc(c4CNC(=O)c34)-c3cnc4cc(F)ccn34)ccc2[C@H]2CCOC2)C1
InChI Key InChIKey=JAJGIMSEYAGXJX-HKUYNNGSSA-N
Data  5 IC50
  Tab Delimited (TSV)   2D SDfile   Computed 3D by Vconf -m prep SDfile
Find this compound or compounds like it in BindingDB:
Activity Spreadsheet -- Enzyme Inhibition Constant Data from BindingDB
Found 5 hits for monomerid = 501106
TargetMitogen-activated protein kinase kinase kinase kinase 1(Homo sapiens (Human))
Nimbus Saturn
US Patent
LigandPNGBDBM501106(4-(7- fluoroimidazo [1,2-a]pyridin- 3-yl)-7-((6-((...)
Affinity DataIC50: <100nM. Assay description: HPK1 biochemical enzyme assay: HPK1 enzyme inhibition was measured using a microfluidic mobility shift assay. Reactions were performed in a 384-well ...
Ligand InfoPC cidPC sid
In DepthDetails US Patent
TargetMitogen-activated protein kinase kinase kinase kinase 1(Homo sapiens (Human))
Nimbus Saturn
US Patent
LigandPNGBDBM501106(4-(7- fluoroimidazo [1,2-a]pyridin- 3-yl)-7-((6-((...)
Affinity DataIC50: <100nM. Assay description: HPK1 biochemical enzyme assay: HPK1 enzyme inhibition was measured using a microfluidic mobility shift assay. Reactions were performed in a 384-well ...
Ligand InfoPC cidPC sid
In DepthDetails US Patent
TargetMitogen-activated protein kinase kinase kinase kinase 1(Homo sapiens (Human))
Nimbus Saturn
US Patent
LigandPNGBDBM501106(4-(7- fluoroimidazo [1,2-a]pyridin- 3-yl)-7-((6-((...)
Affinity DataIC50: <100nM. Assay description: HPK1 biochemical enzyme assay: HPK1 enzyme inhibition was measured using a microfluidic mobility shift assay. Reactions were performed in a 384-well ...
Ligand InfoPC cidPC sid
In DepthDetails US Patent
TargetMitogen-activated protein kinase kinase kinase kinase 1(Homo sapiens (Human))
Nimbus Saturn
US Patent
LigandPNGBDBM501106(4-(7- fluoroimidazo [1,2-a]pyridin- 3-yl)-7-((6-((...)
Affinity DataIC50: <100nM. Assay description: HPK1 biochemical enzyme assay: HPK1 enzyme inhibition was measured using a microfluidic mobility shift assay. Reactions were performed in a 384-well ...
Ligand InfoPC cidPC sid
In DepthDetails US Patent
TargetMitogen-activated protein kinase kinase kinase kinase 1(Homo sapiens (Human))
Nimbus Saturn
US Patent
LigandPNGBDBM501106(4-(7- fluoroimidazo [1,2-a]pyridin- 3-yl)-7-((6-((...)
Affinity DataIC50: <100nM. Assay description: HPK1 biochemical enzyme assay: HPK1 enzyme inhibition was measured using a microfluidic mobility shift assay. Reactions were performed in a 384-well ...
Ligand InfoPC cidPC sid
In DepthDetails US Patent