BDBM50110701 CHEMBL3605837
SMILES Nc1c2CCCc2nc2c3CCCc3nn12
InChI Key InChIKey=DKJLZDLLDSQAOK-UHFFFAOYSA-N
Data  2 IC50
  Tab Delimited (TSV)   2D SDfile   Computed 3D by Vconf -m prep SDfile
Find this compound or compounds like it in BindingDB:
Activity Spreadsheet -- Enzyme Inhibition Constant Data from BindingDB
Found 2 hits for monomerid = 50110701
TargetAcetylcholinesterase(Electrophorus electricus (Electric eel))
Nanjing University Of Chinese Medicine
Curated by ChEMBL
LigandPNGBDBM50110701(CHEMBL3605837)
Affinity DataIC50:  7.41E+3nM. Assay description: Inhibition of Electrophorus electricus AChE pre-incubated for 5 mins before acetylthiocholine iodide substrate addition by Ellman's method
In DepthDetails ArticlePubMed
TargetCholinesterase(Equus caballus (Horse))
Nanjing University Of Chinese Medicine
Curated by ChEMBL
LigandPNGBDBM50110701(CHEMBL3605837)
Affinity DataIC50:  6.09E+4nM. Assay description: Inhibition of equine serum BChE pre-incubated for 5 mins before butyrylthiocholineiodide substrate addition by Ellman's method
In DepthDetails ArticlePubMed