BDBM50111538 2-Amino-N-[13-(4-amino-butyl)-7,22-dibenzyl-5-carbamoylmethyl-10-(1-hydroxy-ethyl)-16,19-bis-(1H-indol-3-ylmethyl)-6,9,12,15,18,21,24-heptaoxo-1,2-dithia-5,8,11,14,17,20,23-heptaaza-cyclohexacos-25-yl]-3-phenyl-propionamide::CHEMBL438999
SMILES C[C@@H](O)[C@@H]1NC(=O)[C@@H](CCCCN)NC(=O)[C@@H](Cc2c[nH]c3ccccc23)NC(=O)[C@@H](Cc2c[nH]c3ccccc23)NC(=O)[C@H](Cc2ccccc2)NC(=O)CN(CCSSCCN(CC(N)=O)C(=O)[C@@H](Cc2ccccc2)NC1=O)C(=O)C(N)Cc1ccccc1
InChI Key InChIKey=XXARYYWOYVMQSN-KHSOBOBBSA-N
Data  5 IC50
  Tab Delimited (TSV)   2D SDfile   Computed 3D by Vconf -m prep SDfile
Find this compound or compounds like it in BindingDB:
Activity Spreadsheet -- Enzyme Inhibition Constant Data from BindingDB
Found 5 hits for monomerid = 50111538
TargetSomatostatin receptor type 3(Homo sapiens (Human))
Hebrew University
Curated by ChEMBL
LigandPNGBDBM50111538(2-Amino-N-[13-(4-amino-butyl)-7,22-dibenzyl-5-carb...)
Affinity DataIC50: >100nM. Assay description: Binding affinity of human Somatostatin receptor type 3 (hsst3) by the displacement of [125I]- Tyr11 somatostatin-14 in CHO-K1 cells
In DepthDetails ArticlePubMed
TargetSomatostatin receptor type 4(Homo sapiens (Human))
Hebrew University
Curated by ChEMBL
LigandPNGBDBM50111538(2-Amino-N-[13-(4-amino-butyl)-7,22-dibenzyl-5-carb...)
Affinity DataIC50: >100nM. Assay description: Binding affinity of human Somatostatin receptor type 4 (hsst4) by the displacement of [125I]- Tyr11 somatostatin-14 in CHO-K1 cells
In DepthDetails ArticlePubMed
TargetSomatostatin receptor type 1(Homo sapiens (Human))
Hebrew University
Curated by ChEMBL
LigandPNGBDBM50111538(2-Amino-N-[13-(4-amino-butyl)-7,22-dibenzyl-5-carb...)
Affinity DataIC50: >1.00E+3nM. Assay description: Binding affinity of human Somatostatin receptor type 1 (hsst1) by the displacement of [125I]- Tyr11 somatostatin-14 in CHO-K1 cells.
In DepthDetails ArticlePubMed
TargetSomatostatin receptor type 2(Homo sapiens (Human))
Hebrew University
Curated by ChEMBL
LigandPNGBDBM50111538(2-Amino-N-[13-(4-amino-butyl)-7,22-dibenzyl-5-carb...)
Affinity DataIC50:  2.5nM. Assay description: Binding affinity of human Somatostatin receptor type 2 (hsst2) by the displacement of [125I]- Tyr11 somatostatin-14 in CHO-K1 cells
In DepthDetails ArticlePubMed
TargetSomatostatin receptor type 5(Homo sapiens (Human))
Hebrew University
Curated by ChEMBL
LigandPNGBDBM50111538(2-Amino-N-[13-(4-amino-butyl)-7,22-dibenzyl-5-carb...)
Affinity DataIC50:  18.2nM. Assay description: Binding affinity of human Somatostatin receptor type 5 (hsst5) by the displacement of [125I]- Tyr11 somatostatin-14 in CHO-K1 cells
In DepthDetails ArticlePubMed