BDBM50111729 CHEMBL277695::N-(5-Carbamimidoyl-thiophen-2-ylmethyl)-2-(6-methyl-2-oxo-3-phenethylamino-2H-pyrazin-1-yl)-acetamide
SMILES Cc1cnc(NCCc2ccccc2)c(=O)n1CC(=O)NCc1ccc(s1)C(N)=N
InChI Key InChIKey=RBXLABNLPAAXCE-UHFFFAOYSA-N
Data  2 KI
  Tab Delimited (TSV)   2D SDfile   Computed 3D by Vconf -m prep SDfile
Find this compound or compounds like it in BindingDB:
Activity Spreadsheet -- Enzyme Inhibition Constant Data from BindingDB
Found 2 hits for monomerid = 50111729
TargetProthrombin(Homo sapiens (Human))
Corvas International
Curated by ChEMBL
LigandPNGBDBM50111729(CHEMBL277695 | N-(5-Carbamimidoyl-thiophen-2-ylmet...)
Affinity DataKi:  0.120nM. Assay description: In vitro inhibitory constant against human thrombin (FIIa).
In DepthDetails ArticlePubMed
TargetSerine protease 1(Homo sapiens (Human))
Corvas International
Curated by ChEMBL
LigandPNGBDBM50111729(CHEMBL277695 | N-(5-Carbamimidoyl-thiophen-2-ylmet...)
Affinity DataKi:  4.40nM. Assay description: In vitro inhibitory constant against trypsin
In DepthDetails ArticlePubMed