BDBM50111739 CHEMBL19811::N-((S)-2-Amino-1,4,5,6-tetrahydro-pyrimidin-5-ylmethyl)-2-(6-methyl-2-oxo-3-phenylmethanesulfonylamino-2H-pyridin-1-yl)-acetamide
SMILES Cc1ccc(NS(=O)(=O)Cc2ccccc2)c(=O)n1CC(=O)NC[C@@H]1CNC(N)=NC1
InChI Key InChIKey=WZGVFLGFGIJCPY-UHFFFAOYSA-N
Data  1 KI
  Tab Delimited (TSV)   2D SDfile   Computed 3D by Vconf -m prep SDfile
Find this compound or compounds like it in BindingDB:
Activity Spreadsheet -- Enzyme Inhibition Constant Data from BindingDB
Found 1 hit for monomerid = 50111739
TargetProthrombin(Homo sapiens (Human))
Corvas International
Curated by ChEMBL
LigandPNGBDBM50111739(CHEMBL19811 | N-((S)-2-Amino-1,4,5,6-tetrahydro-py...)
Affinity DataKi:  1nM. Assay description: In vitro inhibitory constant against human thrombin (FIIa).
In DepthDetails ArticlePubMed