BDBM50112508 4'-{2-Ethyl-6-[1-(1-imino-ethyl)-piperidin-4-yloxy]-benzoimidazol-1-ylmethyl}-biphenyl-4-carboxamidine::CHEMBL25184
SMILES CCc1nc2ccc(OC3CCN(CC3)C(C)=N)cc2n1Cc1ccc(cc1)-c1ccc(cc1)C(N)=N
InChI Key InChIKey=VKNTYOZSHHKHTK-UHFFFAOYSA-N
Data  3 KI
  Tab Delimited (TSV)   2D SDfile   Computed 3D by Vconf -m prep SDfile
Find this compound or compounds like it in BindingDB:
Activity Spreadsheet -- Enzyme Inhibition Constant Data from BindingDB
Found 3 hits for monomerid = 50112508
TargetProthrombin(Homo sapiens (Human))
Berlex Biosciences
Curated by ChEMBL
LigandPNGBDBM50112508(4'-{2-Ethyl-6-[1-(1-imino-ethyl)-piperidin-4-yloxy...)
Affinity DataKi:  22nM. Assay description: Tested in vitro for the selectivity against thrombin (IIa)
In DepthDetails ArticlePubMed
TargetSerine protease 1(Homo sapiens (Human))
Berlex Biosciences
Curated by ChEMBL
LigandPNGBDBM50112508(4'-{2-Ethyl-6-[1-(1-imino-ethyl)-piperidin-4-yloxy...)
Affinity DataKi:  91nM. Assay description: Tested in vitro for the selectivity against trypsin (Trp)
In DepthDetails ArticlePubMed
TargetCoagulation factor X(Homo sapiens (Human))
Berlex Biosciences
Curated by ChEMBL
LigandPNGBDBM50112508(4'-{2-Ethyl-6-[1-(1-imino-ethyl)-piperidin-4-yloxy...)
Affinity DataKi:  180nM. Assay description: Tested in vitro for the inhibitory potency against Coagulation factor Xa
In DepthDetails ArticlePubMed