BDBM50112588 2-[2-{2-[2-(2-{2-[2-(2-Amino-3-methyl-butyrylamino)-3-cyclohexyl-propionylamino]-acetylamino}-5-guanidino-pentylamino)-4-methyl-pentanoylamino]-3-methyl-pentanoylamino}-3-(3H-imidazol-4-yl)-propionylamino]-succinic acid::CHEMBL60563
SMILES CC[C@H](C)[C@H](NC(=O)[C@H](CC(C)C)NC[C@H](CCCNC(N)=N)NC(=O)CNC(=O)[C@H](CC1CCCCC1)NC(=O)[C@@H](N)C(C)C)C(=O)N[C@@H](Cc1cnc[nH]1)C(=O)N[C@@H](CC(O)=O)C(O)=O
InChI Key InChIKey=CHBMSLNLVJPYOD-KIZNPXEASA-N
Data  1 KI
  Tab Delimited (TSV)   2D SDfile   Computed 3D by Vconf -m prep SDfile
Find this compound or compounds like it in BindingDB:
Activity Spreadsheet -- Enzyme Inhibition Constant Data from BindingDB
Found 1 hit for monomerid = 50112588
TargetGenome polyprotein(Human rhinovirus B)
Carlsberg Laboratory
Curated by ChEMBL
LigandPNGBDBM50112588(2-[2-{2-[2-(2-{2-[2-(2-Amino-3-methyl-butyrylamino...)
Affinity DataKi:  7.16E+4nM. Assay description: Inhibition of Leishmania mexicana Cysteine protease B (CPB2.8deltaCTE) was obtained in a solution-phase assay
In DepthDetails ArticlePubMed