BDBM501134 (S)-7-((6- ((dimetlnlamino)- methyl)-5- ((tetrahydrofur- an-3- yl)oxy)pyridin- 2-yl)amino)- 4-(1-methyl-1H- pyrrolo[2,3- b]pyridin-4- yl)-2,3- dihydro-1H- pyrrolo[3,4- c]pyridin-1- one::US11021481, Compound I-806::US11078201, Compound I-806::US11548890, Compound I-806
SMILES CN(C)Cc1nc(Nc2cnc(c3CNC(=O)c23)-c2ccnc3n(C)ccc23)ccc1O[C@H]1CCOC1
InChI Key InChIKey=ZPSSRIRIDUIEIA-INIZCTEOSA-N
Data  5 IC50
  Tab Delimited (TSV)   2D SDfile   Computed 3D by Vconf -m prep SDfile
Find this compound or compounds like it in BindingDB:
Activity Spreadsheet -- Enzyme Inhibition Constant Data from BindingDB
Found 5 hits for monomerid = 501134
TargetMitogen-activated protein kinase kinase kinase kinase 1(Homo sapiens (Human))
Nimbus Saturn
US Patent
LigandPNGBDBM501134((S)-7-((6- ((dimetlnlamino)- methyl)-5- ((tetrahyd...)
Affinity DataIC50: <100nM. Assay description: HPK1 biochemical enzyme assay: HPK1 enzyme inhibition was measured using a microfluidic mobility shift assay. Reactions were performed in a 384-well ...
Ligand InfoPC cidPC sid
In DepthDetails US Patent
TargetMitogen-activated protein kinase kinase kinase kinase 1(Homo sapiens (Human))
Nimbus Saturn
US Patent
LigandPNGBDBM501134((S)-7-((6- ((dimetlnlamino)- methyl)-5- ((tetrahyd...)
Affinity DataIC50: <100nM. Assay description: HPK1 biochemical enzyme assay: HPK1 enzyme inhibition was measured using a microfluidic mobility shift assay. Reactions were performed in a 384-well ...
Ligand InfoPC cidPC sid
In DepthDetails US Patent
TargetMitogen-activated protein kinase kinase kinase kinase 1(Homo sapiens (Human))
Nimbus Saturn
US Patent
LigandPNGBDBM501134((S)-7-((6- ((dimetlnlamino)- methyl)-5- ((tetrahyd...)
Affinity DataIC50: <100nM. Assay description: HPK1 biochemical enzyme assay: HPK1 enzyme inhibition was measured using a microfluidic mobility shift assay. Reactions were performed in a 384-well ...
Ligand InfoPC cidPC sid
In DepthDetails US Patent
TargetMitogen-activated protein kinase kinase kinase kinase 1(Homo sapiens (Human))
Nimbus Saturn
US Patent
LigandPNGBDBM501134((S)-7-((6- ((dimetlnlamino)- methyl)-5- ((tetrahyd...)
Affinity DataIC50: <100nM. Assay description: HPK1 biochemical enzyme assay: HPK1 enzyme inhibition was measured using a microfluidic mobility shift assay. Reactions were performed in a 384-well ...
Ligand InfoPC cidPC sid
In DepthDetails US Patent
TargetMitogen-activated protein kinase kinase kinase kinase 1(Homo sapiens (Human))
Nimbus Saturn
US Patent
LigandPNGBDBM501134((S)-7-((6- ((dimetlnlamino)- methyl)-5- ((tetrahyd...)
Affinity DataIC50: <100nM. Assay description: HPK1 biochemical enzyme assay: HPK1 enzyme inhibition was measured using a microfluidic mobility shift assay. Reactions were performed in a 384-well ...
Ligand InfoPC cidPC sid
In DepthDetails US Patent