BDBM50115351 4-(6,7-Dimethoxy-quinazolin-4-yl)-piperazine-1-carboxylic acid (4-p-tolyloxy-phenyl)-amide::CHEMBL105227
SMILES COc1cc2ncnc(N3CCN(CC3)C(=O)Nc3ccc(Oc4ccc(C)cc4)cc3)c2cc1OC
InChI Key InChIKey=HUHZGAWBFDEQRC-UHFFFAOYSA-N
Data  1 IC50
  Tab Delimited (TSV)   2D SDfile   Computed 3D by Vconf -m prep SDfile
Find this compound or compounds like it in BindingDB:
Activity Spreadsheet -- Enzyme Inhibition Constant Data from BindingDB
Found 1 hit for monomerid = 50115351
TargetPlatelet-derived growth factor receptor beta(Homo sapiens (Human))
Pharmaceutical Research Institute
Curated by ChEMBL
LigandPNGBDBM50115351(4-(6,7-Dimethoxy-quinazolin-4-yl)-piperazine-1-car...)
Affinity DataIC50:  20nM. Assay description: Inhibition of Platelet-derived growth factor receptor beta phosphorylation
In DepthDetails ArticlePubMed