BDBM50115935 (E)-3-(1-Amino-isoquinolin-7-yl)-2-fluoro-but-2-enoic acid (3-fluoro-2'-sulfamoyl-biphenyl-4-yl)-amide::CHEMBL62288
SMILES C\C(=C(/F)C(=O)Nc1ccc(cc1F)-c1ccccc1S(N)(=O)=O)c1ccc2ccnc(N)c2c1
InChI Key InChIKey=FLCBADIIGVYFAJ-OEAKJJBVSA-N
Data  1 KI  3 IC50
  Tab Delimited (TSV)   2D SDfile   Computed 3D by Vconf -m prep SDfile
Find this compound or compounds like it in BindingDB:
Activity Spreadsheet -- Enzyme Inhibition Constant Data from BindingDB
Found 4 hits for monomerid = 50115935
TargetCoagulation factor X(Homo sapiens (Human))
Millennium Pharmaceuticals
Curated by ChEMBL
LigandPNGBDBM50115935((E)-3-(1-Amino-isoquinolin-7-yl)-2-fluoro-but-2-en...)
Affinity DataKi:  1.60nM. Assay description: Binding affinity of the compound towards Coagulation factor X
In DepthDetails ArticlePubMed
TargetSerine protease 1(Homo sapiens (Human))
Millennium Pharmaceuticals
Curated by ChEMBL
LigandPNGBDBM50115935((E)-3-(1-Amino-isoquinolin-7-yl)-2-fluoro-but-2-en...)
Affinity DataIC50:  9.70E+3nM. Assay description: Concentration of the compound required for inhibition of trypsin
In DepthDetails ArticlePubMed
TargetCoagulation factor X(Homo sapiens (Human))
Millennium Pharmaceuticals
Curated by ChEMBL
LigandPNGBDBM50115935((E)-3-(1-Amino-isoquinolin-7-yl)-2-fluoro-but-2-en...)
Affinity DataIC50:  5nM. Assay description: Concentration required for inhibition of Coagulation factor X
In DepthDetails ArticlePubMed
TargetProthrombin(Homo sapiens (Human))
Millennium Pharmaceuticals
Curated by ChEMBL
LigandPNGBDBM50115935((E)-3-(1-Amino-isoquinolin-7-yl)-2-fluoro-but-2-en...)
Affinity DataIC50:  6.30E+3nM. Assay description: Concentration of the compound required for inhibition of Coagulation factor II
In DepthDetails ArticlePubMed